{"text_format":"1","workbook":"xlsx","n_sheets":6,"sheets":["class1","class2","data1","data2","高二多元選修課程開課名單","高二多元選修課程(原班級名單"],"not_rendered":{"charts":0,"images":0,"macros":1,"external_links":2,"defined_names":2,"comments":0,"pivot_tables":0},"unopened":[],"bounds":{"document_bytes":16777216,"sheet_cells":100000,"rows_first":2000,"rows_last":500,"rows_between":2000,"halvings":0,"cell_chars":16384,"cell_head_chars":4096},"cells_cut":0,"cells_raw":0,"read":"whole","date_system":"1900"}

{"sheet":"class1","index":0,"n_rows":24,"n_cols":5,"rows_kept":24,"cut":false,"hidden":true,"merged":[]}
["原班級","課程","教師姓名","上課教室"]
["建築一甲","多元文化:從韓劇、韓流學韓國文化-帶狀",{"$f":"VLOOKUP(B2,[1]List!$A$1:$G$60,5,FALSE)","v":"張依雯"},{"$f":"VLOOKUP(B2,[1]List!$A$1:$G$60,7,FALSE)","v":"電子一甲"},{"$f":"LEFT(B2,4)","v":"多元文化"}]
["建築一乙","C語言程式初探-帶狀",{"$f":"VLOOKUP(B3,[1]List!$A$1:$G$60,5,FALSE)","v":"曾葉強"},{"$f":"VLOOKUP(B3,[1]List!$A$1:$G$60,7,FALSE)","v":"電子科505"},{"$f":"LEFT(B3,4)","v":"C語言程"}]
["機械一甲","基礎重量訓練-帶狀",{"$f":"VLOOKUP(B4,[1]List!$A$1:$G$60,5,FALSE)","v":"陳贊仁"},{"$f":"VLOOKUP(B4,[1]List!$A$1:$G$60,7,FALSE)","v":"樂育堂重訓室"},"基礎重量"]
["綜職一甲","汽機車保養技術-帶狀",{"$f":"VLOOKUP(B5,[1]List!$A$1:$G$60,5,FALSE)","v":"莊加宏"},{"$f":"VLOOKUP(B5,[1]List!$A$1:$G$60,7,FALSE)","v":"101工場"},"汽機車保"]
["汽車一甲","國防通識與軍訓教育-帶狀",{"$f":"VLOOKUP(B6,[1]List!$A$1:$G$60,5,FALSE)","v":"林博謙"},{"$f":"VLOOKUP(B6,[1]List!$A$1:$G$60,7,FALSE)","v":"軍訓教室"},"國防通識"]
["汽車一乙","水準儀測量-帶狀",{"$f":"VLOOKUP(B7,[1]List!$A$1:$G$60,5,FALSE)","v":"謝柏志"},{"$f":"VLOOKUP(B7,[1]List!$A$1:$G$60,7,FALSE)","v":"建築科A101"},"水準儀測"]
["製圖一甲","金屬工藝創作入門-帶狀",{"$f":"VLOOKUP(B8,[1]List!$A$1:$G$60,5,FALSE)","v":"林仲淮"},{"$f":"VLOOKUP(B8,[1]List!$A$1:$G$60,7,FALSE)","v":"機械科303"},"金屬工藝"]
["資訊一甲","養生保健一起來-帶狀",{"$f":"VLOOKUP(B9,[1]List!$A$1:$G$60,5,FALSE)","v":"張美智"},{"$f":"VLOOKUP(B9,[1]List!$A$1:$G$60,7,FALSE)","v":"健護教室"},"養生保健"]
["電子一甲","國文補強-練功坊(彈性)-帶狀",{"$f":"VLOOKUP(B10,[1]List!$A$1:$G$60,5,FALSE)","v":"俆淑菁"},{"$f":"VLOOKUP(B10,[1]List!$A$1:$G$60,7,FALSE)","v":"建築一乙"},"國文補強"]
["電子一乙","輕鬆學英語-帶狀",{"$f":"VLOOKUP(B11,[1]List!$A$1:$G$60,5,FALSE)","v":"蕭婉婷"},{"$f":"VLOOKUP(B11,[1]List!$A$1:$G$60,7,FALSE)","v":"建築一甲"},"輕鬆學英"]
["電機一甲","海洋休閒-釣魚大觀園-帶狀",{"$f":"VLOOKUP(B12,[1]List!$A$1:$G$60,5,FALSE)","v":"陳庭祥"},{"$f":"VLOOKUP(B12,[1]List!$A$1:$G$60,7,FALSE)","v":"建築科A205"},"海洋休閒"]
["電機一乙","基本邏輯應用控制電路實習-帶狀",{"$f":"VLOOKUP(B13,[1]List!$A$1:$G$60,5,FALSE)","v":"張陳傑"},{"$f":"VLOOKUP(B13,[1]List!$A$1:$G$60,7,FALSE)","v":"電機科408"},"基本邏輯"]
["電繪一甲","Visual Basic主控制台程式設計-帶狀",{"$f":"VLOOKUP(B14,[1]List!$A$1:$G$60,5,FALSE)","v":"張凱倢"},{"$f":"VLOOKUP(B14,[1]List!$A$1:$G$60,7,FALSE)","v":"資訊科電腦室"},"Visu"]
["機建一甲","低壓工業配線電路檢測實習-帶狀",{"$f":"VLOOKUP(B15,[1]List!$A$1:$G$60,5,FALSE)","v":"許保強"},{"$f":"VLOOKUP(B15,[1]List!$A$1:$G$60,7,FALSE)","v":"電機科405"},"低壓工業"]
[null,"物聯網與無人機技術實作-帶狀",{"$f":"VLOOKUP(B16,[1]List!$A$1:$G$60,5,FALSE)","v":"紀銘華"},{"$f":"VLOOKUP(B16,[1]List!$A$1:$G$60,7,FALSE)","v":"圖書館電腦室"},"物聯網與"]
[null,"自主學習1",{"$f":"VLOOKUP(B17,[1]List!$A$1:$G$60,5,FALSE)","v":"許汶檳"},{"$f":"VLOOKUP(B17,[1]List!$A$1:$G$60,7,FALSE)","v":"製圖科工廠"},{"$f":"LEFT(B17,5)","v":"自主學習1"}]
[null,"自主學習2",{"$f":"VLOOKUP(B18,[1]List!$A$1:$G$60,5,FALSE)","v":"林群策"},{"$f":"VLOOKUP(B18,[1]List!$A$1:$G$60,7,FALSE)","v":"自主學習中心"},{"$f":"LEFT(B18,5)","v":"自主學習2"}]
[null,"自主學習3",{"$f":"VLOOKUP(B19,[1]List!$A$1:$G$60,5,FALSE)","v":"沈鈺玲"},{"$f":"VLOOKUP(B19,[1]List!$A$1:$G$60,7,FALSE)","v":"機械科工廠"},"自主學習3"]
[null,"自主學習4",{"$f":"VLOOKUP(B20,[1]List!$A$1:$G$60,5,FALSE)","v":"廖士閎"},{"$f":"VLOOKUP(B20,[1]List!$A$1:$G$60,7,FALSE)","v":"自主學習中心"},"自主學習4"]
[null,"自主學習5",{"$f":"VLOOKUP(B21,[1]List!$A$1:$G$60,5,FALSE)","v":"蕭佳虹"},{"$f":"VLOOKUP(B21,[1]List!$A$1:$G$60,7,FALSE)","v":"建築科工場"},"自主學習5"]
[null,"自主學習6",{"$f":"VLOOKUP(B22,[1]List!$A$1:$G$60,5,FALSE)","v":"王迪華"},{"$f":"VLOOKUP(B22,[1]List!$A$1:$G$60,7,FALSE)","v":"建築科工場"},"自主學習6"]
[null,"漫談烘培",{"$f":"VLOOKUP(B23,[1]List!$A$1:$G$60,5,FALSE)","v":"黃温淳"},{"$f":"VLOOKUP(B23,[1]List!$A$1:$G$60,7,FALSE)","v":"綜職一甲"},"漫談烘培"]
[null,"牌卡研究2-一般",{"$f":"VLOOKUP(B24,[1]List!$A$1:$G$60,5,FALSE)","v":"郭婉婷"},{"$f":"VLOOKUP(B24,[1]List!$A$1:$G$60,7,FALSE)","v":"社團教室3-2"},"牌卡研究"]

{"sheet":"class2","index":1,"n_rows":25,"n_cols":4,"rows_kept":25,"cut":false,"hidden":true,"merged":[]}
["原班級","課程","教師姓名","上課教室"]
["建築二甲","擴增實境-互動式應用-帶狀",{"$f":"VLOOKUP(B2,[2]List!$A$1:$G$32,5,FALSE)","v":"楊鈞凱"},{"$f":"VLOOKUP(B2,[2]List!$A$1:$G$32,7,FALSE)","v":"計概教室"}]
["建築二乙","鍵盤飛舞-倉頡中英打-帶狀",{"$f":"VLOOKUP(B3,[2]List!$A$1:$G$32,5,FALSE)","v":"高丁仁"},{"$f":"VLOOKUP(B3,[2]List!$A$1:$G$32,7,FALSE)","v":"電子科507"}]
["機械二甲","電子電路製作實習-帶狀",{"$f":"VLOOKUP(B4,[2]List!$A$1:$G$32,5,FALSE)","v":"沈明祥"},{"$f":"VLOOKUP(B4,[2]List!$A$1:$G$32,7,FALSE)","v":"資訊科604"}]
["綜職二甲","海洋休閒-釣魚大觀園-帶狀",{"$f":"VLOOKUP(B5,[2]List!$A$1:$G$32,5,FALSE)","v":"陳庭祥"},{"$f":"VLOOKUP(B5,[2]List!$A$1:$G$32,7,FALSE)","v":"建築科A205"}]
["汽車二甲","車禍肇事分析-帶狀",{"$f":"VLOOKUP(B6,[2]List!$A$1:$G$32,5,FALSE)","v":"許聰明"},{"$f":"VLOOKUP(B6,[2]List!$A$1:$G$32,7,FALSE)","v":"A203工場"}]
["汽車二乙","水準儀測量-帶狀",{"$f":"VLOOKUP(B7,[2]List!$A$1:$G$32,5,FALSE)","v":"謝柏志"},{"$f":"VLOOKUP(B7,[2]List!$A$1:$G$32,7,FALSE)","v":"建築科A101"}]
["製圖二甲","小論文寫作及研究方法-帶狀",{"$f":"VLOOKUP(B8,[2]List!$A$1:$G$32,5,FALSE)","v":"黃文政"},{"$f":"VLOOKUP(B8,[2]List!$A$1:$G$32,7,FALSE)","v":"機械科302"}]
["資訊二甲","繪畫基礎-帶狀",{"$f":"VLOOKUP(B9,[2]List!$A$1:$G$32,5,FALSE)","v":"陳春壅"},{"$f":"VLOOKUP(B9,[2]List!$A$1:$G$32,7,FALSE)","v":"美術教室"}]
["電子二甲","歌劇與音樂劇-帶狀",{"$f":"VLOOKUP(B10,[2]List!$A$1:$G$32,5,FALSE)","v":"黃渝婷"},{"$f":"VLOOKUP(B10,[2]List!$A$1:$G$32,7,FALSE)","v":"音樂教室"}]
["電子二乙","電子學基礎強化-帶狀",{"$f":"VLOOKUP(B11,[2]List!$A$1:$G$32,5,FALSE)","v":"吳文榮"},{"$f":"VLOOKUP(B11,[2]List!$A$1:$G$32,7,FALSE)","v":"電子二甲"}]
["電機二甲","探索人體奧秘-帶狀",{"$f":"VLOOKUP(B12,[2]List!$A$1:$G$32,5,FALSE)","v":"張美智"},{"$f":"VLOOKUP(B12,[2]List!$A$1:$G$32,7,FALSE)","v":"健護教室"}]
["電機二乙","高二下數學練功坊(彈性)-帶狀",{"$f":"VLOOKUP(B13,[2]List!$A$1:$G$32,5,FALSE)","v":"陳淑華"},{"$f":"VLOOKUP(B13,[2]List!$A$1:$G$32,7,FALSE)","v":"機械二甲"}]
["汽修二甲","國文補強-加工坊(彈性)-帶狀",{"$f":"VLOOKUP(B14,[2]List!$A$1:$G$32,5,FALSE)","v":"邱靜綺"},{"$f":"VLOOKUP(B14,[2]List!$A$1:$G$32,7,FALSE)","v":"資訊二甲"}]
["機建二甲","Google雲端應用實務-一般",{"$f":"VLOOKUP(B15,[2]List!$A$1:$G$32,5,FALSE)","v":"張陳傑"},{"$f":"VLOOKUP(B15,[2]List!$A$1:$G$32,7,FALSE)","v":"電機科406"}]
[null,"IOT物聯網初探-一般",{"$f":"VLOOKUP(B16,[2]List!$A$1:$G$32,5,FALSE)","v":"曾葉強"},{"$f":"VLOOKUP(B16,[2]List!$A$1:$G$32,7,FALSE)","v":"電子科505"}]
[null,"國防科技-一般",{"$f":"VLOOKUP(B17,[2]List!$A$1:$G$32,5,FALSE)","v":"丁士翔"},{"$f":"VLOOKUP(B17,[2]List!$A$1:$G$32,7,FALSE)","v":"汽車二乙"}]
[null,"美國文化與歷史-一般",{"$f":"VLOOKUP(B18,[2]List!$A$1:$G$32,5,FALSE)","v":"程和專"},{"$f":"VLOOKUP(B18,[2]List!$A$1:$G$32,7,FALSE)","v":"電子二乙"}]
[null,"台灣百岳群覽-一般",{"$f":"VLOOKUP(B19,[2]List!$A$1:$G$32,5,FALSE)","v":"許欽智"},{"$f":"VLOOKUP(B19,[2]List!$A$1:$G$32,7,FALSE)","v":"電機二乙"}]
[null,"牌卡研究3-一般",{"$f":"VLOOKUP(B20,[2]List!$A$1:$G$32,5,FALSE)","v":"劉鑑霆"},{"$f":"VLOOKUP(B20,[2]List!$A$1:$G$32,7,FALSE)","v":"電機二甲"}]
[null,"漫談烘培",{"$f":"VLOOKUP(B21,[2]List!$A$1:$G$32,5,FALSE)","v":"邱仕偉"},"綜職二甲"]
[null,"餐旅大進擊-一般",{"$f":"VLOOKUP(B22,[2]List!$A$1:$G$32,5,FALSE)","v":"羅商3"},{"$f":"VLOOKUP(B22,[2]List!$A$1:$G$32,7,FALSE)","v":"羅東高商"}]
[null,"電商X網紅直播-一般",{"$f":"VLOOKUP(B23,[2]List!$A$1:$G$32,5,FALSE)","v":"羅商1"},{"$f":"VLOOKUP(B23,[2]List!$A$1:$G$32,7,FALSE)","v":"羅東高商"}]
[null,"農場經營實務-一般",{"$f":"VLOOKUP(B24,[2]List!$A$1:$G$32,5,FALSE)","v":"羅商4"},{"$f":"VLOOKUP(B24,[2]List!$A$1:$G$32,7,FALSE)","v":"羅東高商"}]
[null,"會計與理財-一般",{"$f":"VLOOKUP(B25,[2]List!$A$1:$G$32,5,FALSE)","v":"羅商2"},{"$f":"VLOOKUP(B25,[2]List!$A$1:$G$32,7,FALSE)","v":"羅東高商"}]

{"sheet":"data1","index":2,"n_rows":500,"n_cols":4,"rows_kept":500,"cut":false,"hidden":true,"merged":[]}
["原班級","學號","姓名","課程"]
["建築一甲",910101,"江宜蓁",{"$error":"#N/A"}]
["建築一甲",910102,"李若瑜",{"$error":"#N/A"}]
["建築一甲",910103,"林羽涵",{"$error":"#N/A"}]
["建築一甲",910104,"林汶晴",{"$error":"#N/A"}]
["建築一甲",910105,"林芷嫻",{"$error":"#N/A"}]
["建築一甲",910106,"徐才婷",{"$error":"#N/A"}]
["建築一甲",910107,"莊子昀",{"$error":"#N/A"}]
["建築一甲",910108,"陳芊堉",{"$error":"#N/A"}]
["建築一甲",910109,"陳秋琳",{"$error":"#N/A"}]
["建築一甲",910110,"陳蓓郁",{"$error":"#N/A"}]
["建築一甲",910111,"陳諼侑",{"$error":"#N/A"}]
["建築一甲",910112,"賴荺蓁",{"$error":"#N/A"}]
["建築一甲",910113,"謝金岑",{"$error":"#N/A"}]
["建築一甲",910114,"江佳恩",{"$error":"#N/A"}]
["建築一甲",910115,"吳秉原",{"$error":"#N/A"}]
["建築一甲",910116,"吳庭溢",{"$error":"#N/A"}]
["建築一甲",910117,"李承翰",{"$error":"#N/A"}]
["建築一甲",910118,"林柏瑞",{"$error":"#N/A"}]
["建築一甲",910119,"林楷晉",{"$error":"#N/A"}]
["建築一甲",910120,"邱登裕",{"$error":"#N/A"}]
["建築一甲",910121,"洪韻麒",{"$error":"#N/A"}]
["建築一甲",910122,"翁廷陞",{"$error":"#N/A"}]
["建築一甲",910123,"高柏翰",{"$error":"#N/A"}]
["建築一甲",910124,"張正賢",{"$error":"#N/A"}]
["建築一甲",910125,"許子宸",{"$error":"#N/A"}]
["建築一甲",910126,"陳令軒",{"$error":"#N/A"}]
["建築一甲",910127,"陳君翔",{"$error":"#N/A"}]
["建築一甲",910128,"陳奕勳",{"$error":"#N/A"}]
["建築一甲",910129,"陳柏勳",{"$error":"#N/A"}]
["建築一甲",910130,"陳致廷",{"$error":"#N/A"}]
["建築一甲",910131,"游育誠",{"$error":"#N/A"}]
["建築一甲",910132,"黃子祐",{"$error":"#N/A"}]
["建築一甲",910133,"葉凱恩",{"$error":"#N/A"}]
["建築一甲",910134,"熊庭漢",{"$error":"#N/A"}]
["建築一甲",910135,"潘子淵",{"$error":"#N/A"}]
["建築一甲",910136,"謝承佑",{"$error":"#N/A"}]
["建築一甲",910137,"藍義傑",{"$error":"#N/A"}]
["建築一乙",910201,"吳玟希",{"$error":"#N/A"}]
["建築一乙",910202,"李嘉雯",{"$error":"#N/A"}]
["建築一乙",910203,"林子岑",{"$error":"#N/A"}]
["建築一乙",910204,"林思涵",{"$error":"#N/A"}]
["建築一乙",910205,"林鈺庭",{"$error":"#N/A"}]
["建築一乙",910206,"邱庭瑜",{"$error":"#N/A"}]
["建築一乙",910207,"柯純貞",{"$error":"#N/A"}]
["建築一乙",910208,"張嘉瑄",{"$error":"#N/A"}]
["建築一乙",910209,"陳書涵",{"$error":"#N/A"}]
["建築一乙",910210,"陳靜郁",{"$error":"#N/A"}]
["建築一乙",910211,"游心寧",{"$error":"#N/A"}]
["建築一乙",910212,"葉千銣",{"$error":"#N/A"}]
["建築一乙",910213,"簡子庭",{"$error":"#N/A"}]
["建築一乙",910214,"王立凱",{"$error":"#N/A"}]
["建築一乙",910215,"王凱加",{"$error":"#N/A"}]
["建築一乙",910216,"朱振豪",{"$error":"#N/A"}]
["建築一乙",910217,"林子桓",{"$error":"#N/A"}]
["建築一乙",910218,"林靖傑",{"$error":"#N/A"}]
["建築一乙",910219,"俞彥廷",{"$error":"#N/A"}]
["建築一乙",910220,"張子揚",{"$error":"#N/A"}]
["建築一乙",910221,"張翊軒",{"$error":"#N/A"}]
["建築一乙",910222,"張凱翔",{"$error":"#N/A"}]
["建築一乙",910223,"張齊恩",{"$error":"#N/A"}]
["建築一乙",910224,"曹詠銓",{"$error":"#N/A"}]
["建築一乙",910225,"陳志杰",{"$error":"#N/A"}]
["建築一乙",910226,"彭煒翔",{"$error":"#N/A"}]
["建築一乙",910227,"游識宇",{"$error":"#N/A"}]
["建築一乙",910228,"葉子辰",{"$error":"#N/A"}]
["建築一乙",910229,"鄒丞泓",{"$error":"#N/A"}]
["建築一乙",910230,"劉宇帆",{"$error":"#N/A"}]
["建築一乙",910231,"劉鎧旭",{"$error":"#N/A"}]
["建築一乙",910232,"蔡詠竣",{"$error":"#N/A"}]
["建築一乙",910233,"鄭詳翰",{"$error":"#N/A"}]
["建築一乙",910234,"黎智文",{"$error":"#N/A"}]
["建築一乙",910235,"賴致君",{"$error":"#N/A"}]
["建築一乙",910236,"謝宗佑",{"$error":"#N/A"}]
["建築一乙",910237,"陳允臻",{"$error":"#N/A"}]
["機械一甲",911101,"江岳衡",{"$error":"#N/A"}]
["機械一甲",911102,"吳浩丞",{"$error":"#N/A"}]
["機械一甲",911103,"呂子暘",{"$error":"#N/A"}]
["機械一甲",911104,"呂柏樂",{"$error":"#N/A"}]
["機械一甲",911105,"李丞鈞",{"$error":"#N/A"}]
{"$rows_left_out":421}
{"sheet":"data2","index":3,"n_rows":500,"n_cols":4,"rows_kept":500,"cut":false,"hidden":true,"merged":[]}
["班級","學號","姓名","選課結果"]
["建築二甲",810101,"毛巧勻",{"$error":"#N/A"}]
["建築二甲",810102,"吳芸萱",{"$error":"#N/A"}]
["建築二甲",810103,"宋蕎安",{"$error":"#N/A"}]
["建築二甲",810104,"林采玲",{"$error":"#N/A"}]
["建築二甲",810105,"林詩涵",{"$error":"#N/A"}]
["建築二甲",810106,"張佳惠",{"$error":"#N/A"}]
["建築二甲",810108,"陳明珠",{"$error":"#N/A"}]
["建築二甲",810109,"楊庭瑜",{"$error":"#N/A"}]
["建築二甲",810110,"羅菀萱",{"$error":"#N/A"}]
["建築二甲",810111,"吳宇森",{"$error":"#N/A"}]
["建築二甲",810112,"吳安資",{"$error":"#N/A"}]
["建築二甲",810113,"吳晉晟",{"$error":"#N/A"}]
["建築二甲",810114,"呂承澤",{"$error":"#N/A"}]
["建築二甲",810115,"李思賢",{"$error":"#N/A"}]
["建築二甲",810117,"林千祐",{"$error":"#N/A"}]
["建築二甲",810118,"林汯諺",{"$error":"#N/A"}]
["建築二甲",810119,"林冠宏",{"$error":"#N/A"}]
["建築二甲",810120,"林政揚",{"$error":"#N/A"}]
["建築二甲",810121,"林昱辰",{"$error":"#N/A"}]
["建築二甲",810122,"林哲渝",{"$error":"#N/A"}]
["建築二甲",810123,"邱培堃",{"$error":"#N/A"}]
["建築二甲",810124,"邱暐竣",{"$error":"#N/A"}]
["建築二甲",810125,"張哲罡",{"$error":"#N/A"}]
["建築二甲",810126,"張閔鈞",{"$error":"#N/A"}]
["建築二甲",810127,"陳侑群",{"$error":"#N/A"}]
["建築二甲",810128,"陳承佑",{"$error":"#N/A"}]
["建築二甲",810129,"陳柏勳",{"$error":"#N/A"}]
["建築二甲",810130,"陳振華",{"$error":"#N/A"}]
["建築二甲",810131,"游淯揚",{"$error":"#N/A"}]
["建築二甲",810132,"黃冠翔",{"$error":"#N/A"}]
["建築二甲",810133,"楊富安",{"$error":"#N/A"}]
["建築二甲",810134,"廖良岳",{"$error":"#N/A"}]
["建築二甲",810135,"賴承佑",{"$error":"#N/A"}]
["建築二甲",810136,"簡東楷",{"$error":"#N/A"}]
["建築二甲",810137,"簡翰",{"$error":"#N/A"}]
["建築二甲",810138,"王捷臻",{"$error":"#N/A"}]
["建築二乙",810203,"林玗柔",{"$error":"#N/A"}]
["建築二乙",810204,"邱子綺",{"$error":"#N/A"}]
["建築二乙",810206,"許睿庭",{"$error":"#N/A"}]
["建築二乙",810207,"陳妍希",{"$error":"#N/A"}]
["建築二乙",810208,"黃米瑜",{"$error":"#N/A"}]
["建築二乙",810209,"劉子瑀",{"$error":"#N/A"}]
["建築二乙",810210,"藍詩晴",{"$error":"#N/A"}]
["建築二乙",810211,"王智弘",{"$error":"#N/A"}]
["建築二乙",810212,"朱祐莨",{"$error":"#N/A"}]
["建築二乙",810213,"江以文",{"$error":"#N/A"}]
["建築二乙",810214,"吳易檠",{"$error":"#N/A"}]
["建築二乙",810215,"吳秉恆",{"$error":"#N/A"}]
["建築二乙",810216,"吳庭宇",{"$error":"#N/A"}]
["建築二乙",810217,"李曉龍",{"$error":"#N/A"}]
["建築二乙",810219,"林庭寬",{"$error":"#N/A"}]
["建築二乙",810220,"林能凱",{"$error":"#N/A"}]
["建築二乙",810221,"林譽展",{"$error":"#N/A"}]
["建築二乙",810222,"邱琮祐",{"$error":"#N/A"}]
["建築二乙",810223,"張一誠",{"$error":"#N/A"}]
["建築二乙",810224,"張凱侑",{"$error":"#N/A"}]
["建築二乙",810225,"郭嘉愷",{"$error":"#N/A"}]
["建築二乙",810226,"陳右薰",{"$error":"#N/A"}]
["建築二乙",810227,"陳易凡",{"$error":"#N/A"}]
["建築二乙",810228,"陳昱鈞",{"$error":"#N/A"}]
["建築二乙",810229,"陳偉誠",{"$error":"#N/A"}]
["建築二乙",810231,"黃凱正",{"$error":"#N/A"}]
["建築二乙",810232,"楊浚宏",{"$error":"#N/A"}]
["建築二乙",810233,"劉志軒",{"$error":"#N/A"}]
["建築二乙",810234,"賴羽彥",{"$error":"#N/A"}]
["建築二乙",810235,"謝承恩",{"$error":"#N/A"}]
["建築二乙",810236,"簡家駿",{"$error":"#N/A"}]
["建築二乙",810238,"黃熙恩",{"$error":"#N/A"}]
["機械二甲",811101,"黃子芸",{"$error":"#N/A"}]
["機械二甲",811102,"吳建龍",{"$error":"#N/A"}]
["機械二甲",811103,"吳政峰",{"$error":"#N/A"}]
["機械二甲",811104,"吳柏輝",{"$error":"#N/A"}]
["機械二甲",811105,"吳庭睿",{"$error":"#N/A"}]
["機械二甲",811106,"呂芃凱",{"$error":"#N/A"}]
["機械二甲",811107,"呂書寰",{"$error":"#N/A"}]
["機械二甲",811108,"林少捷",{"$error":"#N/A"}]
["機械二甲",811109,"林志立",{"$error":"#N/A"}]
["機械二甲",811111,"林炳揚",{"$error":"#N/A"}]
["機械二甲",811112,"林豫德",{"$error":"#N/A"}]
{"$rows_left_out":421}
{"sheet":"高二多元選修課程開課名單","index":4,"n_rows":408,"n_cols":19,"rows_kept":408,"cut":false,"hidden":false,"merged":[[398,13,398,18],[399,13,402,18],[403,13,403,18],[404,13,407,18],[359,11,362,11],[359,12,362,12],[359,13,386,13],[359,14,386,14],[359,15,386,15],[359,16,386,16],[359,17,386,17],[359,18,386,18],[387,13,397,18],[359,0,362,0],[359,1,361,3],[359,4,362,4],[359,5,362,5],[359,6,362,6],[359,7,362,7],[359,8,362,8],[359,9,362,9],[359,10,362,10],[336,13,346,18],[347,13,347,18],[348,13,351,18],[352,13,352,18],[353,13,356,18],[357,0,357,3],[357,4,357,18],[358,0,358,3],[358,13,358,18],[306,0,306,3],[306,4,306,18],[307,0,307,3],[307,13,307,18],[308,0,311,0],[308,1,310,3],[308,4,311,4],[308,5,311,5],[308,6,311,6],[308,7,311,7],[308,8,311,8],[308,9,311,9],[308,10,311,10],[308,11,311,11],[308,12,311,12],[308,13,335,13],[308,14,335,14],[308,15,335,15],[308,16,335,16],[308,17,335,17],[308,18,335,18],[0,4,0,18],[1,0,1,3],[1,13,1,18],[2,0,5,0],[2,1,4,3],[2,4,5,4],[2,5,5,5],[2,6,5,6],[2,7,5,7],[0,0,0,3],[2,14,29,14],[2,15,29,15],[2,16,29,16],[2,17,29,17],[2,18,29,18],[2,8,5,8],[2,9,5,9],[2,10,5,10],[2,11,5,11],[2,12,5,12],[2,13,29,13],[30,13,40,18],[52,0,52,3],[52,13,52,18],[53,0,56,0],[53,1,55,3],[53,4,56,4],[53,5,56,5],[53,6,56,6],[53,7,56,7],[53,8,56,8],[53,9,56,9],[53,16,80,16],[53,17,80,17],[53,18,80,18],[51,0,51,3],[41,13,41,18],[42,13,45,18],[46,13,46,18],[47,13,50,18],[51,4,51,18],[104,0,107,0],[104,1,106,3],[104,4,107,4],[104,5,107,5],[104,6,107,6],[104,7,107,7],[93,13,96,18],[97,13,97,18],[98,13,101,18],[102,4,102,18],[103,0,103,3],[103,13,103,18],[102,0,102,3],[104,8,107,8],[104,9,107,9],[132,13,142,18],[92,13,92,18],[53,10,56,10],[53,11,56,11],[53,12,56,12],[53,13,80,13],[53,14,80,14],[53,15,80,15],[81,13,91,18],[104,14,131,14],[104,15,131,15],[104,16,131,16],[104,17,131,17],[104,18,131,18],[104,10,107,10],[104,11,107,11],[104,12,107,12],[104,13,131,13],[155,10,158,10],[155,11,158,11],[155,12,158,12],[155,13,182,13],[155,14,182,14],[143,13,143,18],[144,13,147,18],[148,13,148,18],[149,13,152,18],[153,4,153,18],[255,0,255,3],[195,13,198,18],[199,13,199,18],[200,13,203,18],[204,4,204,18],[205,0,205,3],[205,13,205,18],[245,13,245,18],[246,13,249,18],[250,13,250,18],[251,13,254,18],[255,4,255,18],[206,14,233,14],[206,15,233,15],[206,16,233,16],[206,17,233,17],[206,18,233,18],[206,8,209,8],[206,9,209,9],[206,6,209,6],[206,7,209,7],[206,11,209,11],[206,12,209,12],[206,13,233,13],[206,10,209,10],[206,0,209,0],[206,1,208,3],[206,4,209,4],[206,5,209,5],[153,0,153,3],[183,13,193,18],[204,0,204,3],[234,13,244,18],[155,15,182,15],[154,0,154,3],[154,13,154,18],[155,0,158,0],[155,1,157,3],[155,4,158,4],[155,5,158,5],[155,6,158,6],[155,7,158,7],[155,8,158,8],[155,9,158,9],[155,16,182,16],[155,17,182,17],[155,18,182,18],[194,13,194,18],[285,13,295,18],[296,13,296,18],[297,13,300,18],[301,13,301,18],[302,13,305,18],[256,0,256,3],[256,13,256,18],[257,0,260,0],[257,1,259,3],[257,4,260,4],[257,5,260,5],[257,6,260,6],[257,7,260,7],[257,8,260,8],[257,9,260,9],[257,16,284,16],[257,17,284,17],[257,18,284,18],[257,10,260,10],[257,11,260,11],[257,12,260,12],[257,13,284,13],[257,14,284,14],[257,15,284,15]]}
["電機科A505教室",null,null,null,"數位邏輯實習      (多元選修)星期二；第2至4節"]
["上課日期及備註",null,null,null,null,null,null,null,null,null,null,null,null,"附 記"]
["編號","修課學生資料",null,null,null,null,null,null,null,null,null,null,null,"三、本表登載後如須更正，應由任課教師或學務人員在旁簽名。","  書記過處分。","  生輔組（教官室），如有缺席不報或記載不實情況，以偽造文","二、副班長須確實記載缺席人員，並於當日放學時請導師簽章後送","  早退劃「＃」，遲到早退超過十分鐘以曠課論。","一、請任課教師務必點名並登記簽證，遲到劃「○」曠課劃「Ø」"]
[]
[]
[null,"班級","學號","姓名"]
[1,"電機二甲","018102","黃靖惠"]
[2,"電機二甲","018106","呂睿祥"]
[3,"電機二甲","018107","李聿諴"]
[4,"電機二甲","018108","李承駿"]
[5,"電機二甲","018116","邱呈苡"]
[6,"電機二甲","018119","陳志岳"]
[7,"電機二甲","018123","陳衿善"]
[8,"電機二甲","018130","黃裕傑"]
[9,"電機二乙","018203","吳賀臨"]
[10,"電機二乙","018208","李御豪"]
[11,"電機二乙","018217","張智皓"]
[12,"電機二乙","018218","曹寬"]
[13,"電機二乙","018221","許博皓"]
[14,"電機二乙","018222","郭弘毅"]
[15,"電機二乙","018228","陳學羿"]
[16,"電機二乙","018235","鄭俊愷"]
[17,"電機二乙","018236","蕭文治"]
[18]
[19]
[20]
[21]
[22]
[23]
[24]
[25,null,null,null,null,null,null,null,null,null,null,null,null,"\n年\n\n月\n\n日\n星\n期\n(     )"]
[26]
[27]
[28]
[29]
[30]
[31]
[32]
[33]
[34]
[35]
[36,null,null,null,null,null,null,null,null,null,null,null,null,"副 班 長"]
[37]
[38]
[39]
[40]
[41,null,null,null,null,null,null,null,null,null,null,null,null,"任課教師"]
[42,null,null,null,null,null,null,null,null,null,null,null,null,"趙家祥"]
[43]
[44]
[45]
["電機科A403教室",null,null,null,"電子電路實習      (多元選修)星期二；第2至4節"]
["上課日期及備註",null,null,null,null,null,null,null,null,null,null,null,null,"附 記"]
["編號","修課學生資料",null,null,null,null,null,null,null,null,null,null,null,"三、本表登載後如須更正，應由任課教師或學務人員在旁簽名。","  書記過處分。","  生輔組（教官室），如有缺席不報或記載不實情況，以偽造文","二、副班長須確實記載缺席人員，並於當日放學時請導師簽章後送","  早退劃「＃」，遲到早退超過十分鐘以曠課論。","一、請任課教師務必點名並登記簽證，遲到劃「○」曠課劃「Ø」"]
[]
[]
[null,"班級","學號","姓名"]
[1,"電機二甲","018104","江崇輔"]
[2,"電機二甲","018105","江嘉祐"]
[3,"電機二甲","018109","李政學"]
[4,"電機二甲","018115","林炫安"]
[5,"電機二甲","018125","游政誠"]
[6,"電機二甲","018126","游騰毅"]
[7,"電機二甲","018129","黃泰翔"]
[8,"電機二甲","018132","楊宸鎬"]
[9,"電機二甲","018134","劉千瑞"]
[10,"電機二甲","018135","潘奕學"]
[11,"電機二甲","018137","魏文川"]
[12,"電機二乙","018202","吳祈鋒"]
[13,"電機二乙","018219","莊永全"]
[14,"電機二乙","018225","陳宥騰"]
[15,"電機二乙","018226","陳晉頡"]
[16,"電機二乙","018230","黃彥傑"]
[17,"電機二乙","018233","葉亦倫"]
[18,"電機二乙","018234","蔡翊泓"]
[19]
[20]
[21]
[22]
[23]
{"$rows_left_out":329}
{"sheet":"高二多元選修課程(原班級名單","index":5,"n_rows":229,"n_cols":7,"rows_kept":229,"cut":false,"hidden":false,"merged":[[136,0,137,0],[139,0,140,6],[182,0,183,0],[185,0,186,6],[228,0,229,0],[44,0,45,0],[1,0,2,6],[47,0,48,6],[90,0,91,0],[93,0,94,6]]}
[]
["1.請各班學藝給同學簽名後，並給導師簽章後繳回教務處\n2.請各位確認好上課地點，避免找不到教室，有問題者請至教務處\n"]
[]
["原班級","學號","姓名","課程","上課老師","上課教室","簽名確認"]
["電機二甲","欄1","欄2","欄3","欄4","欄5","欄6"]
["111-2","018101","林涵妤","工業電子實習","林帥鳳","電機科A507教室"]
["高二","018102","黃靖惠","數位邏輯實習","趙家祥","電機科A505教室"]
["多元選修","018103","王昱勛","工業電子實習","林帥鳳","電機科A507教室"]
[null,"018104","江崇輔","電子電路實習","徐心詳","電機科A403教室"]
[null,"018105","江嘉祐","電子電路實習","徐心詳","電機科A403教室"]
[null,"018106","呂睿祥","數位邏輯實習","趙家祥","電機科A505教室"]
["上課時間","018107","李聿諴","數位邏輯實習","趙家祥","電機科A505教室"]
["星期二","018108","李承駿","數位邏輯實習","趙家祥","電機科A505教室"]
["第2至4節","018109","李政學","電子電路實習","徐心詳","電機科A403教室"]
[null,"018110","李祐銓","工業電子實習","林帥鳳","電機科A507教室"]
[null,"018111","李訓丞","室內配線實習","許欽智","電機科B301-1教室"]
[null,"018112","李翊民","室內配線實習","許欽智","電機科B301-1教室"]
[null,"018113","李程祐","室內配線實習","許欽智","電機科B301-1教室"]
[null,"018114","林士華","工業電子實習","林帥鳳","電機科A507教室"]
[null,"018115","林炫安","電子電路實習","徐心詳","電機科A403教室"]
[null,"018116","邱呈苡","數位邏輯實習","趙家祥","電機科A505教室"]
[null,"018117","邱柏諺","工業電子實習","林帥鳳","電機科A507教室"]
[null,"018118","施柏丞","工業電子實習","林帥鳳","電機科A507教室"]
[null,"018119","陳志岳","數位邏輯實習","趙家祥","電機科A505教室"]
[null,"018120","陳奕安","工業電子實習","林帥鳳","電機科A507教室"]
[null,"018121","陳奕軒","室內配線實習","許欽智","電機科B301-1教室"]
[null,"018122","陳柏宇","工業電子實習","林帥鳳","電機科A507教室"]
[null,"018123","陳衿善","數位邏輯實習","趙家祥","電機科A505教室"]
[null,"018124","游士弘","室內配線實習","許欽智","電機科B301-1教室"]
[null,"018125","游政誠","電子電路實習","徐心詳","電機科A403教室"]
[null,"018126","游騰毅","電子電路實習","徐心詳","電機科A403教室"]
[null,"018127","黃宇賢","工業電子實習","林帥鳳","電機科A507教室"]
[null,"018128","黃明隆","室內配線實習","許欽智","電機科B301-1教室"]
[null,"018129","黃泰翔","電子電路實習","徐心詳","電機科A403教室"]
[null,"018130","黃裕傑","數位邏輯實習","趙家祥","電機科A505教室"]
[null,"018131","楊育豪","室內配線實習","許欽智","電機科B301-1教室"]
[null,"018132","楊宸鎬","電子電路實習","徐心詳","電機科A403教室"]
[null,"018133","廖哲宇","室內配線實習","許欽智","電機科B301-1教室"]
[null,"018134","劉千瑞","電子電路實習","徐心詳","電機科A403教室"]
[null,"018135","潘奕學","電子電路實習","徐心詳","電機科A403教室"]
[null,"018136","藍國豪","室內配線實習","許欽智","電機科B301-1教室"]
[null,"018137","魏文川","電子電路實習","徐心詳","電機科A403教室"]
[]
[]
["導師簽名"]
[]
[]
["1.請各班學藝給同學簽名後，並給導師簽章後繳回教務處\n2.請各位確認好上課地點，避免找不到教室，有問題者請至教務處\n"]
[]
["原班級","學號","姓名","課程","上課老師","上課教室","簽名確認"]
["電機二乙","欄1","欄2","欄3","欄4","欄5","欄6"]
["111-2","018201","石柏宏","室內配線實習","許欽智","電機科B301-1教室"]
["高二","018202","吳祈鋒","電子電路實習","徐心詳","電機科A403教室"]
["多元選修","018203","吳賀臨","數位邏輯實習","趙家祥","電機科A505教室"]
[null,"018204","呂旻叡","室內配線實習","許欽智","電機科B301-1教室"]
[null,"018205","李承祐","室內配線實習","許欽智","電機科B301-1教室"]
[null,"018206","李哲宇","室內配線實習","許欽智","電機科B301-1教室"]
["上課時間","018207","李浤誌","室內配線實習","許欽智","電機科B301-1教室"]
["星期二","018208","李御豪","數位邏輯實習","趙家祥","電機科A505教室"]
["第2至4節","018209","林威志","工業電子實習","林帥鳳","電機科A507教室"]
[null,"018210","林祐安","工業電子實習","林帥鳳","電機科A507教室"]
[null,"018211","林憲堉","工業電子實習","林帥鳳","電機科A507教室"]
[null,"018213","邱敏駿","室內配線實習","許欽智","電機科B301-1教室"]
[null,"018214","徐健銘","室內配線實習","許欽智","電機科B301-1教室"]
[null,"018216","張偉哲","室內配線實習","許欽智","電機科B301-1教室"]
[null,"018217","張智皓","數位邏輯實習","趙家祥","電機科A505教室"]
[null,"018218","曹寬","數位邏輯實習","趙家祥","電機科A505教室"]
[null,"018219","莊永全","電子電路實習","徐心詳","電機科A403教室"]
[null,"018220","莊睿岳","工業電子實習","林帥鳳","電機科A507教室"]
[null,"018221","許博皓","數位邏輯實習","趙家祥","電機科A505教室"]
[null,"018222","郭弘毅","數位邏輯實習","趙家祥","電機科A505教室"]
[null,"018225","陳宥騰","電子電路實習","徐心詳","電機科A403教室"]
[null,"018226","陳晉頡","電子電路實習","徐心詳","電機科A403教室"]
[null,"018227","陳泰傑","室內配線實習","許欽智","電機科B301-1教室"]
[null,"018228","陳學羿","數位邏輯實習","趙家祥","電機科A505教室"]
[null,"018229","游善文","工業電子實習","林帥鳳","電機科A507教室"]
[null,"018230","黃彥傑","電子電路實習","徐心詳","電機科A403教室"]
[null,"018231","黃語樂","工業電子實習","林帥鳳","電機科A507教室"]
[null,"018232","楊博鈞","工業電子實習","林帥鳳","電機科A507教室"]
[null,"018233","葉亦倫","電子電路實習","徐心詳","電機科A403教室"]
{"$rows_left_out":149}